{"text_format":"1","workbook":"xlsx","n_sheets":2,"sheets":["入力シート","分析補助シート（学校質問）"],"not_rendered":{"charts":1,"images":0,"macros":1,"external_links":0,"defined_names":4,"comments":0,"pivot_tables":0},"unopened":[],"bounds":{"document_bytes":16777216,"sheet_cells":100000,"rows_first":2000,"rows_last":500,"rows_between":2000,"halvings":0,"cell_chars":16384,"cell_head_chars":4096},"cells_cut":0,"cells_raw":0,"read":"whole","date_system":"1900"}

{"sheet":"入力シート","index":0,"n_rows":463,"n_cols":25,"rows_kept":463,"cut":false,"hidden":false,"merged":[[493,1,495,1],[481,2,483,2],[484,2,486,2],[487,2,489,2],[490,2,492,2],[493,2,495,2],[481,3,483,3],[484,3,486,3],[487,3,489,3],[490,3,492,3],[493,3,495,3],[466,3,468,3],[469,3,471,3],[472,3,474,3],[475,3,477,3],[478,3,480,3],[481,1,483,1],[484,1,486,1],[487,1,489,1],[490,1,492,1],[466,1,468,1],[469,1,471,1],[472,1,474,1],[475,1,477,1],[478,1,480,1],[466,2,468,2],[469,2,471,2],[472,2,474,2],[475,2,477,2],[478,2,480,2],[458,1,461,1],[458,2,461,2],[458,3,461,3],[462,0,465,0],[462,1,465,1],[462,2,465,2],[462,3,465,3],[450,1,453,1],[450,2,453,2],[450,3,453,3],[454,1,457,1],[454,2,457,2],[454,3,457,3],[450,0,453,0],[454,0,457,0],[458,0,461,0],[446,0,449,0],[446,1,449,1],[446,2,449,2],[446,3,449,3],[438,0,441,0],[426,1,429,1],[426,2,429,2],[426,3,429,3],[430,0,433,0],[430,1,433,1],[430,2,433,2],[430,3,433,3],[434,0,437,0],[434,1,437,1],[434,2,437,2],[434,3,437,3],[426,0,429,0],[438,1,441,1],[438,2,441,2],[438,3,441,3],[442,0,445,0],[442,1,445,1],[442,2,445,2],[442,3,445,3],[414,1,417,1],[414,2,417,2],[414,3,417,3],[418,0,421,0],[418,1,421,1],[418,2,421,2],[418,3,421,3],[422,0,425,0],[422,1,425,1],[422,2,425,2],[422,3,425,3],[414,0,417,0],[402,1,405,1],[402,2,405,2],[402,3,405,3],[406,0,409,0],[406,1,409,1],[406,2,409,2],[406,3,409,3],[410,0,413,0],[410,1,413,1],[410,2,413,2],[410,3,413,3],[402,0,405,0],[390,1,393,1],[390,2,393,2],[390,3,393,3],[394,0,397,0],[394,1,397,1],[394,2,397,2],[394,3,397,3],[398,0,401,0],[398,1,401,1],[398,2,401,2],[398,3,401,3],[390,0,393,0],[378,1,381,1],[378,2,381,2],[378,3,381,3],[382,1,385,1],[382,2,385,2],[382,3,385,3],[386,0,389,0],[386,1,389,1],[386,2,389,2],[386,3,389,3],[358,0,361,0],[362,0,365,0],[366,0,369,0],[370,0,373,0],[374,0,377,0],[378,0,381,0],[382,0,385,0],[290,0,293,0],[294,0,297,0],[298,0,301,0],[302,0,305,0],[306,0,309,0],[310,0,313,0],[314,0,317,0],[318,0,321,0],[322,0,325,0],[326,0,329,0],[330,0,333,0],[334,0,337,0],[338,0,341,0],[342,0,345,0],[346,0,349,0],[350,0,353,0],[354,0,357,0],[46,0,49,0],[50,0,53,0],[54,0,57,0],[58,0,61,0],[62,0,65,0],[66,0,69,0],[70,0,73,0],[74,0,77,0],[78,0,81,0],[10,0,13,0],[14,0,17,0],[18,0,21,0],[22,0,25,0],[26,0,29,0],[30,0,33,0],[34,0,37,0],[38,0,41,0],[42,0,45,0],[238,2,241,2],[242,1,245,1],[278,1,281,1],[278,2,281,2],[282,1,285,1],[282,2,285,2],[306,1,309,1],[306,2,309,2],[286,1,289,1],[286,2,289,2],[290,1,293,1],[290,2,293,2],[294,1,297,1],[294,2,297,2],[298,1,301,1],[298,2,301,2],[302,1,305,1],[302,2,305,2],[266,1,269,1],[266,2,269,2],[270,1,273,1],[270,2,273,2],[274,1,277,1],[274,2,277,2],[206,1,209,1],[202,1,205,1],[258,2,261,2],[262,1,265,1],[262,2,265,2],[210,1,213,1],[210,2,213,2],[214,1,217,1],[214,2,217,2],[246,1,249,1],[246,2,249,2],[250,1,253,1],[250,2,253,2],[254,1,257,1],[254,2,257,2],[222,1,225,1],[222,2,225,2],[226,1,229,1],[226,2,229,2],[230,1,233,1],[230,2,233,2],[234,1,237,1],[234,2,237,2],[238,1,241,1],[142,1,145,1],[142,2,145,2],[242,2,245,2],[162,1,165,1],[162,2,165,2],[166,1,169,1],[166,2,169,2],[218,1,221,1],[218,2,221,2],[174,1,177,1],[174,2,177,2],[178,1,181,1],[178,2,181,2],[182,1,185,1],[182,2,185,2],[186,1,189,1],[186,2,189,2],[190,1,193,1],[190,2,193,2],[194,1,197,1],[194,2,197,2],[198,1,201,1],[198,2,201,2],[202,2,205,2],[110,2,113,2],[126,1,129,1],[126,2,129,2],[130,1,133,1],[130,2,133,2],[134,1,137,1],[134,2,137,2],[138,1,141,1],[138,2,141,2],[338,2,341,2],[122,1,125,1],[122,2,125,2],[78,1,81,1],[78,2,81,2],[82,1,85,1],[82,2,85,2],[86,1,89,1],[86,2,89,2],[90,1,93,1],[90,2,93,2],[94,1,97,1],[94,2,97,2],[98,1,101,1],[98,2,101,2],[102,1,105,1],[102,2,105,2],[106,1,109,1],[106,2,109,2],[110,1,113,1],[114,1,117,1],[114,2,117,2],[118,1,121,1],[118,2,121,2],[362,1,365,1],[362,2,365,2],[366,1,369,1],[366,2,369,2],[370,1,373,1],[370,2,373,2],[374,1,377,1],[374,2,377,2],[342,1,345,1],[342,2,345,2],[346,1,349,1],[346,2,349,2],[106,3,109,3],[110,3,113,3],[114,3,117,3],[350,1,353,1],[350,2,353,2],[354,1,357,1],[354,2,357,2],[358,1,361,1],[358,2,361,2],[310,1,313,1],[310,2,313,2],[314,1,317,1],[314,2,317,2],[318,1,321,1],[318,2,321,2],[322,1,325,1],[322,2,325,2],[326,1,329,1],[326,2,329,2],[330,1,333,1],[330,2,333,2],[334,1,337,1],[334,2,337,2],[338,1,341,1],[190,3,193,3],[194,3,197,3],[198,3,201,3],[202,3,205,3],[170,3,173,3],[174,3,177,3],[178,3,181,3],[182,3,185,3],[118,3,121,3],[122,3,125,3],[126,3,129,3],[130,3,133,3],[134,3,137,3],[138,3,141,3],[142,3,145,3],[146,3,149,3],[8,24,9,24],[8,4,8,13],[8,3,9,3],[10,3,13,3],[14,3,17,3],[90,3,93,3],[94,3,97,3],[98,3,101,3],[102,3,105,3],[78,3,81,3],[82,3,85,3],[86,3,89,3],[22,3,25,3],[26,3,29,3],[30,3,33,3],[34,3,37,3],[38,3,41,3],[42,3,45,3],[74,1,77,1],[74,2,77,2],[46,1,49,1],[46,3,49,3],[50,3,53,3],[54,3,57,3],[58,3,61,3],[62,3,65,3],[66,3,69,3],[70,3,73,3],[74,3,77,3],[66,1,69,1],[66,2,69,2],[70,1,73,1],[70,2,73,2],[46,2,49,2],[50,1,53,1],[50,2,53,2],[54,1,57,1],[54,2,57,2],[58,1,61,1],[58,2,61,2],[62,1,65,1],[62,2,65,2],[290,3,293,3],[222,3,225,3],[226,3,229,3],[230,3,233,3],[234,3,237,3],[238,3,241,3],[242,3,245,3],[246,3,249,3],[250,3,253,3],[254,3,257,3],[282,3,285,3],[286,3,289,3],[278,3,281,3],[366,3,369,3],[370,3,373,3],[374,3,377,3],[330,3,333,3],[334,3,337,3],[338,3,341,3],[342,3,345,3],[346,3,349,3],[350,3,353,3],[354,3,357,3],[358,3,361,3],[362,3,365,3],[254,0,257,0],[258,0,261,0],[262,0,265,0],[266,0,269,0],[270,0,273,0],[274,0,277,0],[278,0,281,0],[282,0,285,0],[286,0,289,0],[230,0,233,0],[234,0,237,0],[238,0,241,0],[242,0,245,0],[246,0,249,0],[250,0,253,0],[202,0,205,0],[206,0,209,0],[210,0,213,0],[214,0,217,0],[218,0,221,0],[222,0,225,0],[226,0,229,0],[174,0,177,0],[178,0,181,0],[182,0,185,0],[186,0,189,0],[190,0,193,0],[194,0,197,0],[198,0,201,0],[146,0,149,0],[150,0,153,0],[154,0,157,0],[158,0,161,0],[162,0,165,0],[166,0,169,0],[170,0,173,0],[122,0,125,0],[126,0,129,0],[130,0,133,0],[134,0,137,0],[138,0,141,0],[142,0,145,0],[94,0,97,0],[98,0,101,0],[102,0,105,0],[106,0,109,0],[110,0,113,0],[114,0,117,0],[118,0,121,0],[82,0,85,0],[86,0,89,0],[90,0,93,0],[314,3,317,3],[318,3,321,3],[322,3,325,3],[326,3,329,3],[302,3,305,3],[306,3,309,3],[310,3,313,3],[294,3,297,3],[298,3,301,3],[258,3,261,3],[262,3,265,3],[266,3,269,3],[270,3,273,3],[274,3,277,3],[258,1,261,1],[206,3,209,3],[210,3,213,3],[214,3,217,3],[218,3,221,3],[206,2,209,2],[186,3,189,3],[170,1,173,1],[170,2,173,2],[150,3,153,3],[154,3,157,3],[158,3,161,3],[162,3,165,3],[166,3,169,3],[158,2,161,2],[146,1,149,1],[146,2,149,2],[150,1,153,1],[150,2,153,2],[154,1,157,1],[154,2,157,2],[158,1,161,1],[6,12,7,20],[42,1,45,1],[42,2,45,2],[4,1,5,14],[8,1,9,1],[8,2,9,2],[22,2,25,2],[26,1,29,1],[26,2,29,2],[18,3,21,3],[10,1,13,1],[10,2,13,2],[14,1,17,1],[14,2,17,2],[18,1,21,1],[18,2,21,2],[22,1,25,1],[30,1,33,1],[30,2,33,2],[34,1,37,1],[34,2,37,2],[38,1,41,1],[38,2,41,2]]}
[null,"令和８年度全国学力・学習状況調査",null,null,null,null,null,null,null,null,null,null,null,null,null,null,null,null,null,null,null,null,null,null,"小学校調査"]
[null,"回答状況　［学校質問］"]
[]
[]
[]
[]
[null,null,null,null,null,null,null,null,null,null,null,null,"1段目：都道府県(公立)の学校数　2段目：都道府県(公立)の学校数の割合(％)\n3段目：全国(公立)の学校数の割合(％)＿＿"]
[]
[null,"質問\n番号","質問事項","貴校\n回答","選択肢",null,null,null,null,null,null,null,null,null,null,null,null,null,null,null,null,null,null,null,"その他\n無回答"]
[null,null,null,null,"１","２","３","４","５","６","７","８","９","１０","１１","１２","１３","１４","１５","１６","１７","１８","１９","２０"]
[1,"（１）","本年４月１日現在の学校の全学年の児童数",null,54,38,47,25,14,1,null,null,null,null,null,null,null,null,null,null,null,null,null,null,0]
[null,null,null,null,30.2,21.2,26.3,14,7.8,0.6,null,null,null,null,null,null,null,null,null,null,null,null,null,null,0]
[]
[null,null,null,null,11.9,11.2,24,31.9,17.399999999999999,3.6,null,null,null,null,null,null,null,null,null,null,null,null,null,null,0]
[{"$f":"A11+1","v":2},"（２）","本年４月１日現在の第６学年の児童数（特別支援学級の児童数は除く）",null,63,35,23,14,25,16,3,0,0,null,null,null,null,null,null,null,null,null,null,null,0]
[null,null,null,null,35.200000000000003,19.600000000000001,12.8,7.8,14,8.9,1.7,0,0,null,null,null,null,null,null,null,null,null,null,null,0]
[]
[null,null,null,null,14.9,12.4,10.199999999999999,8.8000000000000007,30.4,16.7,5.3,1.1000000000000001,0.3,null,null,null,null,null,null,null,null,null,null,null,0]
[{"$f":"A15+1","v":3},"（３）","本年４月１日現在の学校の全学年の学級数（特別支援学級は除く）",null,47,85,23,9,5,0,9,null,null,null,null,null,null,null,null,null,null,null,null,null,1]
[null,null,null,null,26.3,47.5,12.8,5,2.8,0,5,null,null,null,null,null,null,null,null,null,null,null,null,null,0.6]
[]
[null,null,null,null,11.2,39,28.6,14,4.3,1.4,1.4,null,null,null,null,null,null,null,null,null,null,null,null,null,0.1]
[{"$f":"A19+1","v":4},"（４）","本年４月１日現在の第６学年の学級数（特別支援学級は除く）",null,119,27,12,7,1,0,0,0,13,null,null,null,null,null,null,null,null,null,null,null,0]
[null,null,null,null,66.5,15.1,6.7,3.9,0.6,0,0,0,7.3,null,null,null,null,null,null,null,null,null,null,null,0]
[]
[null,null,null,null,37.799999999999997,29.1,18.899999999999999,8.1,2.2999999999999998,0.7,0.2,0.4,1.9,null,null,null,null,null,null,null,null,null,null,null,0.3]
[{"$f":"A23+1","v":5},"（５）","本年４月１日現在の学校の全教員数（副校長、教頭、主幹教諭、指導教諭、教諭、助教諭、養護教諭、養護助教諭、栄養教諭、講師（常勤））",null,2,48,63,23,19,5,8,5,6,null,null,null,null,null,null,null,null,null,null,null,0]
[null,null,null,null,1.1000000000000001,26.8,35.200000000000003,12.8,10.6,2.8,4.5,2.8,3.4,null,null,null,null,null,null,null,null,null,null,null,0]
[]
[null,null,null,null,0.8,9,20.5,13.4,14.8,13.2,10.1,6.8,11.2,null,null,null,null,null,null,null,null,null,null,null,0.1]
[{"$f":"A27+1","v":6},"（６）","調査対象学年の児童のうち、就学援助を受けている児童の割合",null,31,19,34,31,17,14,11,16,6,null,null,null,null,null,null,null,null,null,null,null,0]
[null,null,null,null,17.3,10.6,19,17.3,9.5,7.8,6.1,8.9,3.4,null,null,null,null,null,null,null,null,null,null,null,0]
[]
[null,null,null,null,11.4,18.5,24.4,19.600000000000001,10.6,6.5,3.7,3.7,1.4,null,null,null,null,null,null,null,null,null,null,null,0.1]
[{"$f":"A31+1","v":7},"（７）","調査対象学年の児童は、熱意をもって勉強していると思いますか",null,35,116,26,2,null,null,null,null,null,null,null,null,null,null,null,null,null,null,null,null,0]
[null,null,null,null,19.600000000000001,64.8,14.5,1.1000000000000001,null,null,null,null,null,null,null,null,null,null,null,null,null,null,null,null,0]
[]
[null,null,null,null,23.2,65.7,10.7,0.4,null,null,null,null,null,null,null,null,null,null,null,null,null,null,null,null,0]
[{"$f":"A35+1","v":8},"（８）","調査対象学年の児童は、授業中の私語が少なく、落ち着いていると思いますか",null,66,77,30,6,null,null,null,null,null,null,null,null,null,null,null,null,null,null,null,null,0]
[null,null,null,null,36.9,43,16.8,3.4,null,null,null,null,null,null,null,null,null,null,null,null,null,null,null,null,0]
{"$rows_left_out":424}
{"sheet":"分析補助シート（学校質問）","index":1,"n_rows":113,"n_cols":25,"rows_kept":113,"cut":false,"hidden":false,"merged":[[3,0,4,0],[3,24,4,24],[3,1,4,1],[3,3,4,3],[3,2,4,2],[3,4,3,13]]}
[{"$f":"入力シート!B1","v":"令和８年度全国学力・学習状況調査"}]
["学校用分析補助シート小学校［学校質問］"]
[]
["№","質問\n番号","質問事項","貴校\n回答","選　択　肢",null,null,null,null,null,null,null,null,null,null,null,null,null,null,null,null,null,null,null,"その他\r\n無回答"]
[null,null,null,null,1,2,3,4,5,6,7,8,9,10,11,12,13,14,15,16,17,18,19,20]
[1,{"$f":"VLOOKUP(A6+5,入力シート!$A$11:$V$378,2,FALSE)","v":"（６）"},{"$f":"VLOOKUP(A6+5,入力シート!$A$11:$J$378,3,FALSE)","v":"調査対象学年の児童のうち、就学援助を受けている児童の割合"},null,11.4,18.5,24.4,19.600000000000001,10.6,6.5,3.7,3.7,1.4,null,null,null,null,null,null,null,null,null,null,null,0.1]
[2,{"$f":"VLOOKUP(A7+5,入力シート!$A$11:$V$378,2,FALSE)","v":"（７）"},{"$f":"VLOOKUP(A7+5,入力シート!$A$11:$J$378,3,FALSE)","v":"調査対象学年の児童は、熱意をもって勉強していると思いますか"},null,23.2,65.7,10.7,0.4,null,null,null,null,null,null,null,null,null,null,null,null,null,null,null,null,0]
[3,{"$f":"VLOOKUP(A8+5,入力シート!$A$11:$V$378,2,FALSE)","v":"（８）"},{"$f":"VLOOKUP(A8+5,入力シート!$A$11:$J$378,3,FALSE)","v":"調査対象学年の児童は、授業中の私語が少なく、落ち着いていると思いますか"},null,32.299999999999997,51.6,14.6,1.5,null,null,null,null,null,null,null,null,null,null,null,null,null,null,null,null,0]
[4,{"$f":"VLOOKUP(A9+5,入力シート!$A$11:$V$378,2,FALSE)","v":"（９）"},{"$f":"VLOOKUP(A9+5,入力シート!$A$11:$J$378,3,FALSE)","v":"調査対象学年の児童は、礼儀正しいと思いますか"},null,26,59.4,13.7,0.9,null,null,null,null,null,null,null,null,null,null,null,null,null,null,null,null,0.1]
[5,{"$f":"VLOOKUP(A10+5,入力シート!$A$11:$V$378,2,FALSE)","v":"（１０）"},{"$f":"VLOOKUP(A10+5,入力シート!$A$11:$J$378,3,FALSE)","v":"調査対象学年の児童に対して、前年度までに、将来就きたい仕事や夢について考えさせる指導を行いましたか"},null,17.2,64.8,17.5,0.4,null,null,null,null,null,null,null,null,null,null,null,null,null,null,null,null,0.1]
[6,{"$f":"VLOOKUP(A11+5,入力シート!$A$11:$V$378,2,FALSE)","v":"（１１）"},{"$f":"VLOOKUP(A11+5,入力シート!$A$11:$J$378,3,FALSE)","v":"調査対象学年の児童に対して、前年度までに、学校生活の中で、児童一人一人のよい点や可能性を見付け評価する（褒めるなど）取組を行いましたか"},null,59.3,39.5,1.1000000000000001,0,null,null,null,null,null,null,null,null,null,null,null,null,null,null,null,null,0.1]
[7,{"$f":"VLOOKUP(A12+5,入力シート!$A$11:$V$378,2,FALSE)","v":"（１２）"},{"$f":"VLOOKUP(A12+5,入力シート!$A$11:$J$378,3,FALSE)","v":"近視の予防の一環として、学校の休み時間（昼休みを含む）や放課後などの時間（部活動の朝練・放課後練習を含む）に屋外に出ることや、読書や電子機器の使用などの近い所を見る作業に当たっての配慮事項（対象から３０ｃｍ以上目を離す、３０分に１回は目を休めるなど）について指導していますか"},null,58,22.5,14.1,5.4,null,null,null,null,null,null,null,null,null,null,null,null,null,null,null,null,0.1]
[8,{"$f":"VLOOKUP(A13+5,入力シート!$A$11:$V$378,2,FALSE)","v":"（１３）"},{"$f":"VLOOKUP(A13+5,入力シート!$A$11:$J$378,3,FALSE)","v":"スクールカウンセラーやスクールソーシャルワーカーによる教育相談に関して、児童が相談したい時に相談できる体制となっていますか"},null,67,28,4.2,0.7,null,null,null,null,null,null,null,null,null,null,null,null,null,null,null,null,0.1]
[9,{"$f":"VLOOKUP(A14+5,入力シート!$A$11:$V$378,2,FALSE)","v":"（１４）"},{"$f":"VLOOKUP(A14+5,入力シート!$A$11:$J$378,3,FALSE)","v":"前年度に、教員が授業で問題を抱えている場合、率先してそのことについて話し合うことを行いましたか"},null,43.3,36.200000000000003,14.2,3.5,0.1,2.5,null,null,null,null,null,null,null,null,null,null,null,null,null,null,0.1]
[10,{"$f":"VLOOKUP(A15+5,入力シート!$A$11:$V$378,2,FALSE)","v":"（１５）"},{"$f":"VLOOKUP(A15+5,入力シート!$A$11:$J$378,3,FALSE)","v":"前年度に、教員が学級の問題を抱えている場合、ともに問題解決に当たることを行いましたか"},null,61.3,28.1,7.4,2,0,1.2,null,null,null,null,null,null,null,null,null,null,null,null,null,null,0.1]
[11,{"$f":"VLOOKUP(A16+5,入力シート!$A$11:$V$378,2,FALSE)","v":"（１６）"},{"$f":"VLOOKUP(A16+5,入力シート!$A$11:$J$378,3,FALSE)","v":"ICTを活用した校務の効率化（事務の軽減）の優良事例を十分に取り入れていますか"},null,44,55.6,0.3,null,null,null,null,null,null,null,null,null,null,null,null,null,null,null,null,null,0.1]
[12,{"$f":"VLOOKUP(A17+5,入力シート!$A$11:$V$378,2,FALSE)","v":"（１７）"},{"$f":"VLOOKUP(A17+5,入力シート!$A$11:$J$378,3,FALSE)","v":"児童の姿や地域の現状等に関する調査や各種データなどに基づき、教育課程を編成し、実施し、評価して改善を図る一連のPDCAサイクルを確立していますか"},null,42.5,54.8,2.5,0,null,null,null,null,null,null,null,null,null,null,null,null,null,null,null,null,0.1]
[13,{"$f":"VLOOKUP(A18+5,入力シート!$A$11:$V$378,2,FALSE)","v":"（１８）"},{"$f":"VLOOKUP(A18+5,入力シート!$A$11:$J$378,3,FALSE)","v":"指導計画の作成に当たっては、教育内容と、教育活動に必要な人的・物的資源等を、地域等の外部の資源を含めて活用しながら効果的に組み合わせていますか"},null,51.5,46.3,2,0,null,null,null,null,null,null,null,null,null,null,null,null,null,null,null,null,0.2]
[14,{"$f":"VLOOKUP(A19+5,入力シート!$A$11:$V$378,2,FALSE)","v":"（１９）"},{"$f":"VLOOKUP(A19+5,入力シート!$A$11:$J$378,3,FALSE)","v":"学校運営上の課題への対応に当たっては、各教職員（支援スタッフを含む）の専門性を活かせるよう適切な役割分担や連携協働をしていますか"},null,61.1,38.200000000000003,0.5,0,null,null,null,null,null,null,null,null,null,null,null,null,null,null,null,null,0.2]
[15,{"$f":"VLOOKUP(A20+5,入力シート!$A$11:$V$378,2,FALSE)","v":"（２０）"},{"$f":"VLOOKUP(A20+5,入力シート!$A$11:$J$378,3,FALSE)","v":"今までの取組をそのまま踏襲するのではなく、新しい取組を導入したり、提案をしたりしてくる教職員が多いですか"},null,36,55.9,7.8,0.1,null,null,null,null,null,null,null,null,null,null,null,null,null,null,null,null,0.2]
[16,{"$f":"VLOOKUP(A21+5,入力シート!$A$11:$V$378,2,FALSE)","v":"（２１）"},{"$f":"VLOOKUP(A21+5,入力シート!$A$11:$J$378,3,FALSE)","v":"教職員が困っているとき、管理職と教職員との間で随時相談できるなど組織的に対応する体制を構築していますか"},null,72.2,27.1,0.5,0,null,null,null,null,null,null,null,null,null,null,null,null,null,null,null,null,0.1]
[17,{"$f":"VLOOKUP(A22+5,入力シート!$A$11:$V$378,2,FALSE)","v":"（２２）"},{"$f":"VLOOKUP(A22+5,入力シート!$A$11:$J$378,3,FALSE)","v":"特定の教員が学級担任を務めるのではなく、複数の教員が共同で学級担任を務める体制（いわゆる、チーム担任制、グループ担任制）を実施していますか"},null,13,19.2,16.399999999999999,51.3,null,null,null,null,null,null,null,null,null,null,null,null,null,null,null,null,0.1]
[18,{"$f":"VLOOKUP(A23+5,入力シート!$A$11:$V$378,2,FALSE)","v":"（２３）"},{"$f":"VLOOKUP(A23+5,入力シート!$A$11:$J$378,3,FALSE)","v":"ストレスチェックの結果の活用や研修など、教職員自身の心身の健康状態につき振り返り対処する機会が提供されていますか"},null,38.200000000000003,50.2,10.6,0.9,null,null,null,null,null,null,null,null,null,null,null,null,null,null,null,null,0.1]
[19,{"$f":"VLOOKUP(A24+5,入力シート!$A$11:$V$378,2,FALSE)","v":"（２４）"},{"$f":"VLOOKUP(A24+5,入力シート!$A$11:$J$378,3,FALSE)","v":"児童にとって、学校施設全体として、児童が学びや生活がしやすく、居心地のよい建物だと思いますか"},null,34.200000000000003,49.1,14.6,1.9,null,null,null,null,null,null,null,null,null,null,null,null,null,null,null,null,0.1]
[20,{"$f":"VLOOKUP(A25+5,入力シート!$A$11:$V$378,2,FALSE)","v":"（２５）"},{"$f":"VLOOKUP(A25+5,入力シート!$A$11:$J$378,3,FALSE)","v":"教職員にとって、学校施設全体として、教職員が働きやすく、居心地のよい建物だと思いますか"},null,29.6,50.9,17.100000000000001,2.2999999999999998,null,null,null,null,null,null,null,null,null,null,null,null,null,null,null,null,0.1]
[21,{"$f":"VLOOKUP(A26+5,入力シート!$A$11:$V$378,2,FALSE)","v":"（２６）"},{"$f":"VLOOKUP(A26+5,入力シート!$A$11:$J$378,3,FALSE)","v":"調査対象学年の児童は、授業では、課題の解決に向けて、自分で考え、自分から取り組むことができていると思いますか"},null,20.399999999999999,67.7,11.5,0.3,null,null,null,null,null,null,null,null,null,null,null,null,null,null,null,null,0.1]
[22,{"$f":"VLOOKUP(A27+5,入力シート!$A$11:$V$378,2,FALSE)","v":"（２７）"},{"$f":"VLOOKUP(A27+5,入力シート!$A$11:$J$378,3,FALSE)","v":"調査対象学年の児童は、授業において、自らの考えがうまく伝わるよう、資料や文章、話の組立てなどを工夫して、発言や発表を行うことができていると思いますか"},null,12.8,66.099999999999994,20.7,0.4,null,null,null,null,null,null,null,null,null,null,null,null,null,null,null,null,0.1]
[23,{"$f":"VLOOKUP(A28+5,入力シート!$A$11:$V$378,2,FALSE)","v":"（２８）"},{"$f":"VLOOKUP(A28+5,入力シート!$A$11:$J$378,3,FALSE)","v":"調査対象学年の児童は、学級やグループでの話合いなどの活動で、自分の考えを相手にしっかりと伝えることができていると思いますか"},null,21.1,66.7,11.9,0.2,null,null,null,null,null,null,null,null,null,null,null,null,null,null,null,null,0.1]
[24,{"$f":"VLOOKUP(A29+5,入力シート!$A$11:$V$378,2,FALSE)","v":"（２９）"},{"$f":"VLOOKUP(A29+5,入力シート!$A$11:$J$378,3,FALSE)","v":"調査対象学年の児童は、授業や学校生活では、友達や周りの人の考えを大切にして、お互いに協力しながら課題の解決に取り組めていると思いますか"},null,31,62.2,6.4,0.3,null,null,null,null,null,null,null,null,null,null,null,null,null,null,null,null,0.1]
[25,{"$f":"VLOOKUP(A30+5,入力シート!$A$11:$V$378,2,FALSE)","v":"（３０）"},{"$f":"VLOOKUP(A30+5,入力シート!$A$11:$J$378,3,FALSE)","v":"調査対象学年の児童は、授業では、自分で学ぶ内容を決め、計画を立てて学ぶ活動を行っていると思いますか"},null,10.5,53.9,33,2.4,null,null,null,null,null,null,null,null,null,null,null,null,null,null,null,null,0.1]
[26,{"$f":"VLOOKUP(A31+5,入力シート!$A$11:$V$378,2,FALSE)","v":"（３１）"},{"$f":"VLOOKUP(A31+5,入力シート!$A$11:$J$378,3,FALSE)","v":"調査対象学年の児童に対して、前年度までに、学習指導において、児童一人一人に応じて、学習課題や活動を工夫しましたか"},null,28.2,63,8.6,0.1,null,null,null,null,null,null,null,null,null,null,null,null,null,null,null,null,0.1]
[27,{"$f":"VLOOKUP(A32+5,入力シート!$A$11:$V$378,2,FALSE)","v":"（３２）"},{"$f":"VLOOKUP(A32+5,入力シート!$A$11:$J$378,3,FALSE)","v":"調査対象学年の児童に対して、前年度までに、学習指導において、児童が、それぞれのよさを生かしながら、他者と情報交換して話し合ったり、異なる視点から考えたり、協力し合ったりできるように学習課題や活動を工夫しましたか"},null,34.4,60.8,4.5999999999999996,0,null,null,null,null,null,null,null,null,null,null,null,null,null,null,null,null,0.2]
[28,{"$f":"VLOOKUP(A33+5,入力シート!$A$11:$V$378,2,FALSE)","v":"（３３）"},{"$f":"VLOOKUP(A33+5,入力シート!$A$11:$J$378,3,FALSE)","v":"調査対象学年の児童に対して、前年度までに、授業において、児童自ら学級やグループで課題を設定し、その解決に向けて話し合い、まとめ、表現するなどの学習活動を取り入れましたか"},null,29.5,60,10.199999999999999,0.2,null,null,null,null,null,null,null,null,null,null,null,null,null,null,null,null,0.2]
[29,{"$f":"VLOOKUP(A34+5,入力シート!$A$11:$V$378,2,FALSE)","v":"（３４）"},{"$f":"VLOOKUP(A34+5,入力シート!$A$11:$J$378,3,FALSE)","v":"調査対象学年の児童に対して、前年度までに、習得・活用及び探究の学習過程を見通した指導方法の改善及び工夫をしましたか"},null,21.4,66.7,11.7,0,null,null,null,null,null,null,null,null,null,null,null,null,null,null,null,null,0.1]
[30,{"$f":"VLOOKUP(A35+5,入力シート!$A$11:$V$378,2,FALSE)","v":"（３５）"},{"$f":"VLOOKUP(A35+5,入力シート!$A$11:$J$378,3,FALSE)","v":"調査対象学年の児童に対して、前年度までに、関連する既習事項を振り返り、知識を総合的に関連付ける学習活動を行いましたか"},null,27,64.7,8.1,0,null,null,null,null,null,null,null,null,null,null,null,null,null,null,null,null,0.2]
[31,{"$f":"VLOOKUP(A36+5,入力シート!$A$11:$V$378,2,FALSE)","v":"（３６）"},{"$f":"VLOOKUP(A36+5,入力シート!$A$11:$J$378,3,FALSE)","v":"調査対象学年の児童に対して、前年度までに、各教科等で身に付けたことを、様々な課題の解決に生かすことができるような機会を設けましたか"},null,18.7,68.3,12.8,0,null,null,null,null,null,null,null,null,null,null,null,null,null,null,null,null,0.2]
[32,{"$f":"VLOOKUP(A37+5,入力シート!$A$11:$V$378,2,FALSE)","v":"（３７）"},{"$f":"VLOOKUP(A37+5,入力シート!$A$11:$J$378,3,FALSE)","v":"調査対象学年の児童に対して、前年度までに、教科等の指導に当たって、地域や社会で起こっている問題や出来事を学習の題材として取り扱いましたか"},null,23,62,14.7,0.2,null,null,null,null,null,null,null,null,null,null,null,null,null,null,null,null,0.1]
[33,{"$f":"VLOOKUP(A38+5,入力シート!$A$11:$V$378,2,FALSE)","v":"（３８）"},{"$f":"VLOOKUP(A38+5,入力シート!$A$11:$J$378,3,FALSE)","v":"調査対象学年の児童に対して、前年度に、本やインターネット、図書館資料などを活用した授業を計画的に行いましたか"},null,48.9,38.799999999999997,11.1,1.1000000000000001,0,null,null,null,null,null,null,null,null,null,null,null,null,null,null,null,0.1]
[34,{"$f":"VLOOKUP(A39+5,入力シート!$A$11:$V$378,2,FALSE)","v":"（３９）"},{"$f":"VLOOKUP(A39+5,入力シート!$A$11:$J$378,3,FALSE)","v":"調査対象学年の児童に対して、総合的な学習の時間において、課題の設定からまとめ・表現に至る探究の過程を意識した指導をしていますか"},null,36.700000000000003,56.6,6.5,0.1,null,null,null,null,null,null,null,null,null,null,null,null,null,null,null,null,0.1]
[35,{"$f":"VLOOKUP(A40+5,入力シート!$A$11:$V$378,2,FALSE)","v":"（４０）"},{"$f":"VLOOKUP(A40+5,入力シート!$A$11:$J$378,3,FALSE)","v":"調査対象学年の児童に対して、総合的な学習の時間において、児童一人一人がICT機器を活用することにより、探究の過程の質が向上することを意識した指導をしていますか"},null,47.1,48.5,4.2,0.1,null,null,null,null,null,null,null,null,null,null,null,null,null,null,null,null,0.1]
{"$rows_left_out":73}